Skip to content

Test Result : (root)

9 failures (+9)
36 tests (-19)
Took 1 sec.

All Failed Tests

Test NameDurationAge
 ISSM Test Suite.MATLAB-218 FAILURE0 ms1
 ISSM Test Suite.MATLAB-244 FAILURE0 ms1
 ISSM Test Suite.MATLAB-250 FAILURE0 ms1
 ISSM Test Suite.MATLAB-251 FAILURE0 ms1
 ISSM Test Suite.MATLAB-412 FAILURE0 ms1
 ISSM Test Suite.MATLAB-413 FAILURE1 sec1
 ISSM Test Suite.MATLAB-414 FAILURE0 ms1
 ISSM Test Suite.MATLAB-417 FAILURE0 ms1
 ISSM Test Suite.MATLAB-440 FAILURE0 ms1

All Tests

ClassDurationFail(diff)Skip(diff)Pass(diff)Total(diff)
ISSM Test Suite1 sec9+909-2718-18
externalpackages0 ms0018-118-1