Skip to content

Test Result : (root)

4 failures (±0)
26 tests (±0)
Took 0 ms.

All Failed Tests

Test NameDurationAge
 ISSM Test Suite.Example-AMR FAILURE0 ms2
 ISSM Test Suite.Example-EsaGRACE FAILURE0 ms2
 ISSM Test Suite.Example-EsaWahr FAILURE0 ms2
 ISSM Test Suite.Example-Greenland FAILURE0 ms2

All Tests

ClassDurationFail(diff)Skip(diff)Pass(diff)Total(diff)
ISSM Test Suite0 ms4048
externalpackages0 ms001818